Target
Mucolipin-3
Ligand
BDBM46880
Substrate
Meas. Tech.
Dose response cell-based high-throughput screening assay for agonists of the transient receptor potential channel ML3 (TRPML3)
EC50
12400±n/a nM
Citation
 PubChem, PC Dose response cell-based high-throughput screening assay for agonists of the transient receptor potential channel ML3 (TRPML3) PubChem Bioassay (2009)[AID] 
Target
Name:
Mucolipin-3
Synonyms:
MCLN3_HUMAN MCOLN3 protein
Type:
Enzyme Catalytic Domain
Mol. Mass.:
64244.09
Organism:
Homo sapiens (Human)
Description:
Q8TDD5
Residue:
553
  
Inhibitor
Name:
BDBM46880
Synonyms:
2-[benzenesulfonyl(methyl)amino]acetic acid [(Z)-[amino-(3-nitrophenyl)methylidene]amino] ester MLS000531185 SMR000136163 [(Z)-[azanyl-(3-nitrophenyl)methylidene]amino] 2-[methyl(phenylsulfonyl)amino]ethanoate | cid_9550613
Type:
Small organic molecule
Emp. Form.:
C16H16N4O6S
Mol. Mass.:
392.386
SMILES:
CN(CC(=O)ON=C(N)c1cccc(c1)[N+]([O-])=O)S(=O)(=O)c1ccccc1
: