Target
Mucolipin-3
Ligand
BDBM40318
Substrate
Meas. Tech.
Dose response cell-based high-throughput screening assay for agonists of the transient receptor potential channel ML3 (TRPML3)
EC50
4100±n/a nM
Citation
 PubChem, PC Dose response cell-based high-throughput screening assay for agonists of the transient receptor potential channel ML3 (TRPML3) PubChem Bioassay (2009)[AID] 
Target
Name:
Mucolipin-3
Synonyms:
MCLN3_HUMAN MCOLN3 protein
Type:
Enzyme Catalytic Domain
Mol. Mass.:
64244.09
Organism:
Homo sapiens (Human)
Description:
Q8TDD5
Residue:
553
  
Inhibitor
Name:
BDBM40318
Synonyms:
1-cyclohexyl-3-(1-phenylethyl)-2,5-pyrrolidinedione 1-cyclohexyl-3-(1-phenylethyl)pyrrolidine-2,5-quinone SMR000143442 | cid_2952519
Type:
Small organic molecule
Emp. Form.:
C18H23NO2
Mol. Mass.:
285.3807
SMILES:
CC(C1CC(=O)N(C2CCCCC2)C1=O)c1ccccc1
: