Target
Mucolipin-3
Ligand
BDBM46902
Substrate
Meas. Tech.
Dose response cell-based high-throughput screening assay for agonists of the transient receptor potential channel ML3 (TRPML3)
EC50
4350±n/a nM
Citation
 PubChem, PC Dose response cell-based high-throughput screening assay for agonists of the transient receptor potential channel ML3 (TRPML3) PubChem Bioassay (2009)[AID] 
Target
Name:
Mucolipin-3
Synonyms:
MCLN3_HUMAN MCOLN3 protein
Type:
Enzyme Catalytic Domain
Mol. Mass.:
64244.09
Organism:
Homo sapiens (Human)
Description:
Q8TDD5
Residue:
553
  
Inhibitor
Name:
BDBM46902
Synonyms:
3-(2,6-dimethylphenyl)sulfonyl-2-isobutoxy-4,6-dimethyl-pyridine 3-[(2,6-dimethylphenyl)sulfonyl]-2-isobutoxy-4,6-dimethylpyridine SMR000180553 | cid_1488517
Type:
Small organic molecule
Emp. Form.:
C19H25NO3S
Mol. Mass.:
347.472
SMILES:
CC(C)COc1nc(C)cc(C)c1S(=O)(=O)c1c(C)cccc1C
: