Target
Mucolipin-3
Ligand
BDBM46905
Substrate
Meas. Tech.
Dose response cell-based high-throughput screening assay for agonists of the transient receptor potential channel ML3 (TRPML3)
EC50
1370±n/a nM
Citation
 PubChem, PC Dose response cell-based high-throughput screening assay for agonists of the transient receptor potential channel ML3 (TRPML3) PubChem Bioassay (2009)[AID] 
Target
Name:
Mucolipin-3
Synonyms:
MCLN3_HUMAN MCOLN3 protein
Type:
Enzyme Catalytic Domain
Mol. Mass.:
64244.09
Organism:
Homo sapiens (Human)
Description:
Q8TDD5
Residue:
553
  
Inhibitor
Name:
BDBM46905
Synonyms:
4-chloranyl-N-(2,4-dimethyl-5-piperidin-1-ylsulfonyl-phenyl)-N-methyl-benzenesulfonamide 4-chloro-N-(2,4-dimethyl-5-piperidinosulfonyl-phenyl)-N-methyl-benzenesulfonamide MLS000575809 cid_2920855
Type:
Small organic molecule
Emp. Form.:
C20H25ClN2O4S2
Mol. Mass.:
457.006
SMILES:
CN(c1cc(c(C)cc1C)S(=O)(=O)N1CCCCC1)S(=O)(=O)c1ccc(Cl)cc1
: