Target
Mucolipin-3
Ligand
BDBM46909
Substrate
Meas. Tech.
Dose response cell-based high-throughput screening assay for agonists of the transient receptor potential channel ML3 (TRPML3)
EC50
2260±n/a nM
Citation
 PubChem, PC Dose response cell-based high-throughput screening assay for agonists of the transient receptor potential channel ML3 (TRPML3) PubChem Bioassay (2009)[AID] 
Target
Name:
Mucolipin-3
Synonyms:
MCLN3_HUMAN MCOLN3 protein
Type:
Enzyme Catalytic Domain
Mol. Mass.:
64244.09
Organism:
Homo sapiens (Human)
Description:
Q8TDD5
Residue:
553
  
Inhibitor
Name:
BDBM46909
Synonyms:
1-(2-isopropyl-5-nitro-phenyl)sulfonylazepane 1-(5-nitro-2-propan-2-ylphenyl)sulfonylazepane MLS000577769 cid_2868441
Type:
Small organic molecule
Emp. Form.:
C15H22N2O4S
Mol. Mass.:
326.411
SMILES:
CC(C)c1ccc(cc1S(=O)(=O)N1CCCCCC1)[N+]([O-])=O
: