Target
Mucolipin-3
Ligand
BDBM46925
Substrate
Meas. Tech.
Dose response cell-based high-throughput screening assay for agonists of the transient receptor potential channel ML3 (TRPML3)
EC50
10400±n/a nM
Citation
 PubChem, PC Dose response cell-based high-throughput screening assay for agonists of the transient receptor potential channel ML3 (TRPML3) PubChem Bioassay (2009)[AID] 
Target
Name:
Mucolipin-3
Synonyms:
MCLN3_HUMAN MCOLN3 protein
Type:
Enzyme Catalytic Domain
Mol. Mass.:
64244.09
Organism:
Homo sapiens (Human)
Description:
Q8TDD5
Residue:
553
  
Inhibitor
Name:
BDBM46925
Synonyms:
2-Fluoro-benzoic acid N'-(2-hydroxy-2,2-diphenyl-acetyl)-N-phenyl-hydrazide 2-fluoro-N'-(2-hydroxy-1-oxo-2,2-diphenylethyl)-N-phenylbenzohydrazide MLS000589444 SMR000212894 | cid_1040178
Type:
Small organic molecule
Emp. Form.:
C27H21FN2O3
Mol. Mass.:
440.4656
SMILES:
OC(C(=O)NN(C(=O)c1ccccc1F)c1ccccc1)(c1ccccc1)c1ccccc1
: