Target
Mucolipin-3
Ligand
BDBM46927
Substrate
Meas. Tech.
Dose response cell-based high-throughput screening assay for agonists of the transient receptor potential channel ML3 (TRPML3)
EC50
2480±n/a nM
Citation
 PubChem, PC Dose response cell-based high-throughput screening assay for agonists of the transient receptor potential channel ML3 (TRPML3) PubChem Bioassay (2009)[AID] 
Target
Name:
Mucolipin-3
Synonyms:
MCLN3_HUMAN MCOLN3 protein
Type:
Enzyme Catalytic Domain
Mol. Mass.:
64244.09
Organism:
Homo sapiens (Human)
Description:
Q8TDD5
Residue:
553
  
Inhibitor
Name:
BDBM46927
Synonyms:
2,4-dimethyl-N-[2-(4-morpholinyl)-5-(trifluoromethyl)phenyl]benzenesulfonamide 2,4-dimethyl-N-[2-morpholino-5-(trifluoromethyl)phenyl]benzenesulfonamide SMR000241537 | cid_2078255
Type:
Small organic molecule
Emp. Form.:
C19H21F3N2O3S
Mol. Mass.:
414.442
SMILES:
Cc1ccc(c(C)c1)S(=O)(=O)Nc1cc(ccc1N1CCOCC1)C(F)(F)F
: