Target
Mucolipin-3
Ligand
BDBM46933
Substrate
Meas. Tech.
Dose response cell-based high-throughput screening assay for agonists of the transient receptor potential channel ML3 (TRPML3)
EC50
5290±n/a nM
Citation
 PubChem, PC Dose response cell-based high-throughput screening assay for agonists of the transient receptor potential channel ML3 (TRPML3) PubChem Bioassay (2009)[AID] 
Target
Name:
Mucolipin-3
Synonyms:
MCLN3_HUMAN MCOLN3 protein
Type:
Enzyme Catalytic Domain
Mol. Mass.:
64244.09
Organism:
Homo sapiens (Human)
Description:
Q8TDD5
Residue:
553
  
Inhibitor
Name:
BDBM46933
Synonyms:
MLS000707608 N-(4-ethoxy-2-nitrophenyl)-2-[(4-fluorophenyl)sulfonylamino]benzamide cid_4138996
Type:
Small organic molecule
Emp. Form.:
C21H18FN3O6S
Mol. Mass.:
459.448
SMILES:
CCOc1ccc(NC(=O)c2ccccc2NS(=O)(=O)c2ccc(F)cc2)c(c1)[N+]([O-])=O
: