Target
Mucolipin-3
Ligand
BDBM46944
Substrate
Meas. Tech.
Dose response cell-based high-throughput screening assay for agonists of the transient receptor potential channel ML3 (TRPML3)
EC50
2070±n/a nM
Citation
 PubChem, PC Dose response cell-based high-throughput screening assay for agonists of the transient receptor potential channel ML3 (TRPML3) PubChem Bioassay (2009)[AID] 
Target
Name:
Mucolipin-3
Synonyms:
MCLN3_HUMAN MCOLN3 protein
Type:
Enzyme Catalytic Domain
Mol. Mass.:
64244.09
Organism:
Homo sapiens (Human)
Description:
Q8TDD5
Residue:
553
  
Inhibitor
Name:
BDBM46944
Synonyms:
1-(2,5-dichlorophenyl)-4-(1-piperidinylsulfonyl)piperazine 1-(2,5-dichlorophenyl)-4-piperidinosulfonyl-piperazine MLS000715888 cid_991661
Type:
Small organic molecule
Emp. Form.:
C15H21Cl2N3O2S
Mol. Mass.:
378.317
SMILES:
Clc1ccc(Cl)c(c1)N1CCN(CC1)S(=O)(=O)N1CCCCC1
: