Target
Mucolipin-3
Ligand
BDBM46948
Substrate
Meas. Tech.
Dose response cell-based high-throughput screening assay for agonists of the transient receptor potential channel ML3 (TRPML3)
EC50
1840±n/a nM
Citation
 PubChem, PC Dose response cell-based high-throughput screening assay for agonists of the transient receptor potential channel ML3 (TRPML3) PubChem Bioassay (2009)[AID] 
Target
Name:
Mucolipin-3
Synonyms:
MCLN3_HUMAN MCOLN3 protein
Type:
Enzyme Catalytic Domain
Mol. Mass.:
64244.09
Organism:
Homo sapiens (Human)
Description:
Q8TDD5
Residue:
553
  
Inhibitor
Name:
BDBM46948
Synonyms:
1-(5-chloranyl-2-methyl-phenyl)-4-piperidin-1-ylsulfonyl-piperazine 1-(5-chloro-2-methylphenyl)-4-(1-piperidinylsulfonyl)piperazine MLS000690533 cid_991660
Type:
Small organic molecule
Emp. Form.:
C16H24ClN3O2S
Mol. Mass.:
357.899
SMILES:
Cc1ccc(Cl)cc1N1CCN(CC1)S(=O)(=O)N1CCCCC1
: