Target
Mucolipin-3
Ligand
BDBM46957
Substrate
Meas. Tech.
Dose response cell-based high-throughput screening assay for agonists of the transient receptor potential channel ML3 (TRPML3)
EC50
2840±n/a nM
Citation
 PubChem, PC Dose response cell-based high-throughput screening assay for agonists of the transient receptor potential channel ML3 (TRPML3) PubChem Bioassay (2009)[AID] 
Target
Name:
Mucolipin-3
Synonyms:
MCLN3_HUMAN MCOLN3 protein
Type:
Enzyme Catalytic Domain
Mol. Mass.:
64244.09
Organism:
Homo sapiens (Human)
Description:
Q8TDD5
Residue:
553
  
Inhibitor
Name:
BDBM46957
Synonyms:
1-(2-methoxy-4-methyl-phenyl)sulfonylazepane MLS000713244 cid_567073
Type:
Small organic molecule
Emp. Form.:
C14H21NO3S
Mol. Mass.:
283.386
SMILES:
COc1cc(C)ccc1S(=O)(=O)N1CCCCCC1
: