Target
Mucolipin-3
Ligand
BDBM46959
Substrate
Meas. Tech.
Dose response cell-based high-throughput screening assay for agonists of the transient receptor potential channel ML3 (TRPML3)
EC50
>29900±n/a nM
Citation
 PubChem, PC Dose response cell-based high-throughput screening assay for agonists of the transient receptor potential channel ML3 (TRPML3) PubChem Bioassay (2009)[AID] 
Target
Name:
Mucolipin-3
Synonyms:
MCLN3_HUMAN MCOLN3 protein
Type:
Enzyme Catalytic Domain
Mol. Mass.:
64244.09
Organism:
Homo sapiens (Human)
Description:
Q8TDD5
Residue:
553
  
Inhibitor
Name:
BDBM46959
Synonyms:
6-ethoxy-2,2,4-trimethyl-1-(4-methylphenyl)sulfonyl-quinoline 6-ethoxy-2,2,4-trimethyl-1-tosyl-quinoline SMR000277762 | cid_1069778
Type:
Small organic molecule
Emp. Form.:
C21H25NO3S
Mol. Mass.:
371.493
SMILES:
CCOc1ccc2N(C(C)(C)C=C(C)c2c1)S(=O)(=O)c1ccc(C)cc1
: