Target
Mucolipin-3
Ligand
BDBM46985
Substrate
Meas. Tech.
Dose response cell-based high-throughput screening assay for agonists of the transient receptor potential channel ML3 (TRPML3)
EC50
>29900±n/a nM
Citation
 PubChem, PC Dose response cell-based high-throughput screening assay for agonists of the transient receptor potential channel ML3 (TRPML3) PubChem Bioassay (2009)[AID] 
Target
Name:
Mucolipin-3
Synonyms:
MCLN3_HUMAN MCOLN3 protein
Type:
Enzyme Catalytic Domain
Mol. Mass.:
64244.09
Organism:
Homo sapiens (Human)
Description:
Q8TDD5
Residue:
553
  
Inhibitor
Name:
BDBM46985
Synonyms:
(2-piperidin-1-ylphenyl) benzenesulfonate MLS000834811 benzenesulfonic acid (2-piperidinophenyl) ester cid_2812556
Type:
Small organic molecule
Emp. Form.:
C17H19NO3S
Mol. Mass.:
317.403
SMILES:
O=S(=O)(Oc1ccccc1N1CCCCC1)c1ccccc1
: