Target
Procathepsin L
Ligand
BDBM41143
Substrate
Meas. Tech.
Cathepsin L dose-response testing in the presence of cysteine
IC50
622.86±262.8 nM
Citation
 PubChem, PC Cathepsin L dose-response testing in the presence of cysteine PubChem Bioassay (2009)[AID] 
Target
Name:
Procathepsin L
Synonyms:
CATL1_HUMAN CTSL CTSL1 Cathepsin L Cathepsin L1 heavy chain MEP cathepsin L preproprotein
Type:
Enzyme
Mol. Mass.:
37557.19
Organism:
Homo sapiens (Human)
Description:
Purchased from Calbiochem (San Diego, CA).
Residue:
333
  
Inhibitor
Name:
BDBM41143
Synonyms:
2-[[5-[(1S)-1-amino-2-phenyl-ethyl]-1,3,4-oxadiazol-2-yl]thio]-N,N-diethyl-acetamide;hydrochloride 2-[[5-[(1S)-1-amino-2-phenylethyl]-1,3,4-oxadiazol-2-yl]thio]-N,N-diethylacetamide;hydrochloride MLS000042030 cid_6603485
Type:
Small organic molecule
Emp. Form.:
C16H22N4O2S
Mol. Mass.:
334.436
SMILES:
CCN(CC)C(=O)CSc1nnc(o1)[C@@H](N)Cc1ccccc1
: