Target
Procathepsin L
Ligand
BDBM41161
Substrate
Meas. Tech.
Cathepsin L dose-response testing in the presence of cysteine
IC50
5171.736667±429.027094 nM
Citation
 PubChem, PC Cathepsin L dose-response testing in the presence of cysteine PubChem Bioassay (2009)[AID] 
Target
Name:
Procathepsin L
Synonyms:
CATL1_HUMAN CTSL CTSL1 Cathepsin L Cathepsin L1 heavy chain MEP cathepsin L preproprotein
Type:
Enzyme
Mol. Mass.:
37557.19
Organism:
Homo sapiens (Human)
Description:
Purchased from Calbiochem (San Diego, CA).
Residue:
333
  
Inhibitor
Name:
BDBM41161
Synonyms:
MLS000087744 N-methyl-3-methylidene-1-phenyl-pent-4-en-1-amine N-methyl-N-(3-methylene-1-phenylpent-4-enyl)amine cid_3241028 | methyl-(3-methylene-1-phenyl-pent-4-enyl)amine
Type:
Small organic molecule
Emp. Form.:
C13H17N
Mol. Mass.:
187.2808
SMILES:
CNC(CC(=C)C=C)c1ccccc1
: