Target
Protein-tyrosine kinase 2-beta
Ligand
BDBM31754
Substrate
Meas. Tech.
TR-FRET counterscreen for FAK inhibitors: dose-response biochemical high throughput screening assay to identify inhibitors of Proline-rich tyrosine kinase 2 (Pyk2)
IC50
>2570±n/a nM
Citation
 PubChem, PC TR-FRET counterscreen for FAK inhibitors: dose-response biochemical high throughput screening assay to identify inhibitors of Proline-rich tyrosine kinase 2 (Pyk2) PubChem Bioassay (2009)[AID] 
Target
Name:
Protein-tyrosine kinase 2-beta
Synonyms:
FAK2 PTK2B PTK2B protein tyrosine kinase 2 beta (PTK2B) Protein tyrosine kinase 2 beta | RAFTK
Type:
Protein
Mol. Mass.:
115868.80
Organism:
Homo sapiens (Human)
Description:
Q14289
Residue:
1009
  
Inhibitor
Name:
BDBM31754
Synonyms:
MLS-0010366.0001 N-(5-phenyl-1,2,4-thiadiazol-3-yl)-2-[(5-phenyl-[1,3]thiazolo[2,3-c][1,2,4]triazol-3-yl)sulfanyl]acetamide N-(5-phenyl-1,2,4-thiadiazol-3-yl)-2-[(5-phenylthiazolo[2,3-c][1,2,4]triazol-3-yl)thio]acetamide | cid_1589738
Type:
Small organic molecule
Emp. Form.:
C20H14N6OS3
Mol. Mass.:
450.56
SMILES:
O=C(CSc1nnc2scc(-c3ccccc3)n12)Nc1nsc(n1)-c1ccccc1
: