Target
Protein-tyrosine kinase 2-beta
Ligand
BDBM41050
Substrate
Meas. Tech.
TR-FRET counterscreen for FAK inhibitors: dose-response biochemical high throughput screening assay to identify inhibitors of Proline-rich tyrosine kinase 2 (Pyk2)
IC50
2794±n/a nM
Citation
 PubChem, PC TR-FRET counterscreen for FAK inhibitors: dose-response biochemical high throughput screening assay to identify inhibitors of Proline-rich tyrosine kinase 2 (Pyk2) PubChem Bioassay (2009)[AID] 
Target
Name:
Protein-tyrosine kinase 2-beta
Synonyms:
FAK2 PTK2B PTK2B protein tyrosine kinase 2 beta (PTK2B) Protein tyrosine kinase 2 beta | RAFTK
Type:
Protein
Mol. Mass.:
115868.80
Organism:
Homo sapiens (Human)
Description:
Q14289
Residue:
1009
  
Inhibitor
Name:
BDBM41050
Synonyms:
(5Z)-5-(4-chlorobenzylidene)-4-(p-phenetidino)-3-thiazolin-2-one (5Z)-5-[(4-chlorophenyl)methylidene]-4-(4-ethoxyanilino)-2-thiazolone 5-[1-(4-Chloro-phenyl)-meth-(Z)-ylidene]-4-[(E)-4-ethoxy-phenylimino]-thiazolidin-2-one SMR000147963 | cid_1182668
Type:
Small organic molecule
Emp. Form.:
C18H15ClN2O2S
Mol. Mass.:
358.842
SMILES:
CCOc1ccc(NC2=NC(=O)SC2=Cc2ccc(Cl)cc2)cc1
: