Target
Protein-tyrosine kinase 2-beta
Ligand
BDBM40727
Substrate
Meas. Tech.
TR-FRET counterscreen for FAK inhibitors: dose-response biochemical high throughput screening assay to identify inhibitors of Proline-rich tyrosine kinase 2 (Pyk2)
IC50
2006±n/a nM
Citation
 PubChem, PC TR-FRET counterscreen for FAK inhibitors: dose-response biochemical high throughput screening assay to identify inhibitors of Proline-rich tyrosine kinase 2 (Pyk2) PubChem Bioassay (2009)[AID] 
Target
Name:
Protein-tyrosine kinase 2-beta
Synonyms:
FAK2 PTK2B PTK2B protein tyrosine kinase 2 beta (PTK2B) Protein tyrosine kinase 2 beta | RAFTK
Type:
Protein
Mol. Mass.:
115868.80
Organism:
Homo sapiens (Human)
Description:
Q14289
Residue:
1009
  
Inhibitor
Name:
BDBM40727
Synonyms:
MLS000537135 N-[(4-fluorobenzylidene)amino]-2-(2-furyl)cinchoninamide N-[(4-fluorophenyl)methylideneamino]-2-(furan-2-yl)quinoline-4-carboxamide cid_1226487
Type:
Small organic molecule
Emp. Form.:
C21H14FN3O2
Mol. Mass.:
359.3532
SMILES:
Fc1ccc(C=NNC(=O)c2cc(nc3ccccc23)-c2ccco2)cc1
: