Target
Phosphomannomutase 2
Ligand
BDBM46619
Substrate
Meas. Tech.
Counter screen SAR assay for PMM2 inhibitors via a fluorescence intensity assay
IC50
9060±n/a nM
Citation
 PubChem, PC Counter screen SAR assay for PMM2 inhibitors via a fluorescence intensity assay PubChem Bioassay (2010)[AID] 
Target
Name:
Phosphomannomutase 2
Synonyms:
PMM2 | PMM2_HUMAN
Type:
Enzyme Catalytic Domain
Mol. Mass.:
28082.33
Organism:
Homo sapiens (Human)
Description:
gi_4557839
Residue:
246
  
Inhibitor
Name:
BDBM46619
Synonyms:
2-(3-chloranyl-2-methyl-phenyl)-6-nitro-4-[2,2,2-tris(fluoranyl)ethoxy]-1,2-benzothiazol-3-one 2-(3-chloro-2-methylphenyl)-6-nitro-4-(2,2,2-trifluoroethoxy)-1,2-benzothiazol-3-one cid_1510390
Type:
Small organic molecule
Emp. Form.:
C16H10ClF3N2O4S
Mol. Mass.:
418.775
SMILES:
Cc1c(Cl)cccc1-n1sc2cc(cc(OCC(F)(F)F)c2c1=O)[N+]([O-])=O
: