Target
Phosphomannomutase 2
Ligand
BDBM46626
Substrate
Meas. Tech.
Counter screen SAR assay for PMM2 inhibitors via a fluorescence intensity assay
IC50
>100000±n/a nM
Citation
 PubChem, PC Counter screen SAR assay for PMM2 inhibitors via a fluorescence intensity assay PubChem Bioassay (2010)[AID] 
Target
Name:
Phosphomannomutase 2
Synonyms:
PMM2 | PMM2_HUMAN
Type:
Enzyme Catalytic Domain
Mol. Mass.:
28082.33
Organism:
Homo sapiens (Human)
Description:
gi_4557839
Residue:
246
  
Inhibitor
Name:
BDBM46626
Synonyms:
2-(2,3-dichlorophenyl)-6-fluoro-1,2-benzothiazol-3-one MLS-0315778.0001 | cid_1510382
Type:
Small organic molecule
Emp. Form.:
C13H6Cl2FNOS
Mol. Mass.:
314.162
SMILES:
Fc1ccc2c(c1)sn(-c1cccc(Cl)c1Cl)c2=O
: