Target
Phosphomannomutase 2
Ligand
BDBM46628
Substrate
Meas. Tech.
Counter screen SAR assay for PMM2 inhibitors via a fluorescence intensity assay
IC50
18300±n/a nM
Citation
 PubChem, PC Counter screen SAR assay for PMM2 inhibitors via a fluorescence intensity assay PubChem Bioassay (2010)[AID] 
Target
Name:
Phosphomannomutase 2
Synonyms:
PMM2 | PMM2_HUMAN
Type:
Enzyme Catalytic Domain
Mol. Mass.:
28082.33
Organism:
Homo sapiens (Human)
Description:
gi_4557839
Residue:
246
  
Inhibitor
Name:
BDBM46628
Synonyms:
2-(2,3-dimethylphenyl)-6-fluoranyl-1,2-benzothiazol-3-one MLS-0315780.0001 | cid_1510380
Type:
Small organic molecule
Emp. Form.:
C15H12FNOS
Mol. Mass.:
273.325
SMILES:
Cc1cccc(c1C)-n1sc2cc(F)ccc2c1=O
: