Target
Phosphomannomutase 2
Ligand
BDBM46637
Substrate
Meas. Tech.
Counter screen SAR assay for PMM2 inhibitors via a fluorescence intensity assay
IC50
10800±n/a nM
Citation
 PubChem, PC Counter screen SAR assay for PMM2 inhibitors via a fluorescence intensity assay PubChem Bioassay (2010)[AID] 
Target
Name:
Phosphomannomutase 2
Synonyms:
PMM2 | PMM2_HUMAN
Type:
Enzyme Catalytic Domain
Mol. Mass.:
28082.33
Organism:
Homo sapiens (Human)
Description:
gi_4557839
Residue:
246
  
Inhibitor
Name:
BDBM46637
Synonyms:
2-(4-bromophenyl)-4,6-dinitro-1,2-benzothiazol-3-one cid_4333778
Type:
Small organic molecule
Emp. Form.:
C13H6BrN3O5S
Mol. Mass.:
396.173
SMILES:
[O-][N+](=O)c1cc([N+]([O-])=O)c2c(c1)sn(-c1ccc(Br)cc1)c2=O
: