Target
Phosphomannomutase 2
Ligand
BDBM34672
Substrate
Meas. Tech.
Counter screen SAR assay for PMM2 inhibitors via a fluorescence intensity assay
IC50
>100000±n/a nM
Citation
 PubChem, PC Counter screen SAR assay for PMM2 inhibitors via a fluorescence intensity assay PubChem Bioassay (2010)[AID] 
Target
Name:
Phosphomannomutase 2
Synonyms:
PMM2 | PMM2_HUMAN
Type:
Enzyme Catalytic Domain
Mol. Mass.:
28082.33
Organism:
Homo sapiens (Human)
Description:
gi_4557839
Residue:
246
  
Inhibitor
Name:
BDBM34672
Synonyms:
(4-chlorodithiazol-5-ylidene)-(4-chlorophenyl)amine 4-chloro-N-(4-chlorophenyl)-5-dithiazolimine MLS000548090 SMR000114199 | cid_691683
Type:
Small organic molecule
Emp. Form.:
C8H4Cl2N2S2
Mol. Mass.:
263.167
SMILES:
Clc1nss\c1=N\c1ccc(Cl)cc1
: