Target
Phosphomannomutase 2
Ligand
BDBM46691
Substrate
Meas. Tech.
Counter screen SAR assay for PMM2 inhibitors via a fluorescence intensity assay
IC50
35600±n/a nM
Citation
 PubChem, PC Counter screen SAR assay for PMM2 inhibitors via a fluorescence intensity assay PubChem Bioassay (2010)[AID] 
Target
Name:
Phosphomannomutase 2
Synonyms:
PMM2 | PMM2_HUMAN
Type:
Enzyme Catalytic Domain
Mol. Mass.:
28082.33
Organism:
Homo sapiens (Human)
Description:
gi_4557839
Residue:
246
  
Inhibitor
Name:
BDBM46691
Synonyms:
2-(4-chlorophenyl)-1,2-benzothiazol-3-one acs.jmedchem.1c00409_ST.175 | cid_11219195
Type:
Small organic molecule
Emp. Form.:
C13H8ClNOS
Mol. Mass.:
261.727
SMILES:
Clc1ccc(cc1)-n1sc2ccccc2c1=O
: