Target
Phosphomannomutase 2
Ligand
BDBM46698
Substrate
Meas. Tech.
Counter screen SAR assay for PMM2 inhibitors via a fluorescence intensity assay
IC50
>100000±n/a nM
Citation
 PubChem, PC Counter screen SAR assay for PMM2 inhibitors via a fluorescence intensity assay PubChem Bioassay (2010)[AID] 
Target
Name:
Phosphomannomutase 2
Synonyms:
PMM2 | PMM2_HUMAN
Type:
Enzyme Catalytic Domain
Mol. Mass.:
28082.33
Organism:
Homo sapiens (Human)
Description:
gi_4557839
Residue:
246
  
Inhibitor
Name:
BDBM46698
Synonyms:
(4-chlorodithiazol-5-ylidene)-[4-(trifluoromethyl)phenyl]amine 4-chloro-N-[4-(trifluoromethyl)phenyl]-5-dithiazolimine MLS-0390883.0001 | cid_25181209
Type:
Small organic molecule
Emp. Form.:
C9H4ClF3N2S2
Mol. Mass.:
296.72
SMILES:
FC(F)(F)c1ccc(cc1)\N=c1/ssnc1Cl
: