Target
Phosphomannomutase 2
Ligand
BDBM46714
Substrate
Meas. Tech.
Counter screen SAR assay for PMM2 inhibitors via a fluorescence intensity assay
IC50
>100000±n/a nM
Citation
 PubChem, PC Counter screen SAR assay for PMM2 inhibitors via a fluorescence intensity assay PubChem Bioassay (2010)[AID] 
Target
Name:
Phosphomannomutase 2
Synonyms:
PMM2 | PMM2_HUMAN
Type:
Enzyme Catalytic Domain
Mol. Mass.:
28082.33
Organism:
Homo sapiens (Human)
Description:
gi_4557839
Residue:
246
  
Inhibitor
Name:
BDBM46714
Synonyms:
(4-chlorodithiazol-5-ylidene)-(2-naphthyl)amine 4-chloro-N-(2-naphthalenyl)-5-dithiazolimine MLS-0390904.0001 | cid_25181222
Type:
Small organic molecule
Emp. Form.:
C12H7ClN2S2
Mol. Mass.:
278.78
SMILES:
Clc1nss\c1=N\c1ccc2ccccc2c1
: