Target
Phosphomannomutase 2
Ligand
BDBM46719
Substrate
Meas. Tech.
Counter screen SAR assay for PMM2 inhibitors via a fluorescence intensity assay
IC50
>100000±n/a nM
Citation
 PubChem, PC Counter screen SAR assay for PMM2 inhibitors via a fluorescence intensity assay PubChem Bioassay (2010)[AID] 
Target
Name:
Phosphomannomutase 2
Synonyms:
PMM2 | PMM2_HUMAN
Type:
Enzyme Catalytic Domain
Mol. Mass.:
28082.33
Organism:
Homo sapiens (Human)
Description:
gi_4557839
Residue:
246
  
Inhibitor
Name:
BDBM46719
Synonyms:
(4-chlorodithiazol-5-ylidene)-(3-chloro-2-methyl-phenyl)amine 4-chloro-N-(3-chloro-2-methylphenyl)-5-dithiazolimine MLS-0390931.0001 | cid_25181239
Type:
Small organic molecule
Emp. Form.:
C9H6Cl2N2S2
Mol. Mass.:
277.193
SMILES:
Cc1c(Cl)cccc1\N=c1/ssnc1Cl
: