Target
Phosphoethanolamine/phosphocholine phosphatase
Ligand
BDBM46646
Substrate
Meas. Tech.
SAR assay for compounds that inhibit PHOSPHO1
IC50
10700±n/a nM
Citation
 PubChem, PC SAR assay for compounds that inhibit PHOSPHO1 PubChem Bioassay (2010)[AID] 
Target
Name:
Phosphoethanolamine/phosphocholine phosphatase
Synonyms:
PHOP1_HUMAN phosphatase, orphan 1
Type:
Enzyme Catalytic Domain
Mol. Mass.:
29718.09
Organism:
Homo sapiens (Human)
Description:
Q8TCT1
Residue:
267
  
Inhibitor
Name:
BDBM46646
Synonyms:
2-(5-morpholin-4-ylsulfonyl-2-pyrrolidin-1-yl-phenyl)-1,2-benzothiazol-3-one 2-(5-morpholinosulfonyl-2-pyrrolidino-phenyl)-1,2-benzothiazol-3-one MLS-0069818.0001 | cid_2327938
Type:
Small organic molecule
Emp. Form.:
C21H23N3O4S2
Mol. Mass.:
445.555
SMILES:
O=c1n(sc2ccccc12)-c1cc(ccc1N1CCCC1)S(=O)(=O)N1CCOCC1
: