Target
Phosphoethanolamine/phosphocholine phosphatase
Ligand
BDBM46037
Substrate
Meas. Tech.
SAR assay for compounds that inhibit PHOSPHO1
IC50
555.3±n/a nM
Citation
 PubChem, PC SAR assay for compounds that inhibit PHOSPHO1 PubChem Bioassay (2010)[AID] 
Target
Name:
Phosphoethanolamine/phosphocholine phosphatase
Synonyms:
PHOP1_HUMAN phosphatase, orphan 1
Type:
Enzyme Catalytic Domain
Mol. Mass.:
29718.09
Organism:
Homo sapiens (Human)
Description:
Q8TCT1
Residue:
267
  
Inhibitor
Name:
BDBM46037
Synonyms:
MLS-0315805.0001 N,N-diethyl-3-(3-oxidanylidene-1,2-benzothiazol-2-yl)benzenesulfonamide cid_2381612
Type:
Small organic molecule
Emp. Form.:
C17H18N2O3S2
Mol. Mass.:
362.466
SMILES:
CCN(CC)S(=O)(=O)c1cccc(c1)-n1sc2ccccc2c1=O
: