Target
Phosphoethanolamine/phosphocholine phosphatase
Ligand
BDBM46656
Substrate
Meas. Tech.
SAR assay for compounds that inhibit PHOSPHO1
IC50
755±n/a nM
Citation
 PubChem, PC SAR assay for compounds that inhibit PHOSPHO1 PubChem Bioassay (2010)[AID] 
Target
Name:
Phosphoethanolamine/phosphocholine phosphatase
Synonyms:
PHOP1_HUMAN phosphatase, orphan 1
Type:
Enzyme Catalytic Domain
Mol. Mass.:
29718.09
Organism:
Homo sapiens (Human)
Description:
Q8TCT1
Residue:
267
  
Inhibitor
Name:
BDBM46656
Synonyms:
2-(diethylamino)ethyl 4-(3-oxidanylidene-1,2-benzothiazol-2-yl)benzoate 4-(3-keto-1,2-benzothiazol-2-yl)benzoic acid 2-(diethylamino)ethyl ester MLS-0315807.0001 | cid_2435967
Type:
Small organic molecule
Emp. Form.:
C20H22N2O3S
Mol. Mass.:
370.465
SMILES:
CCN(CC)CCOC(=O)c1ccc(cc1)-n1sc2ccccc2c1=O
: