Target
Phosphoethanolamine/phosphocholine phosphatase
Ligand
BDBM46087
Substrate
Meas. Tech.
SAR assay for compounds that inhibit PHOSPHO1
IC50
6670±n/a nM
Citation
 PubChem, PC SAR assay for compounds that inhibit PHOSPHO1 PubChem Bioassay (2010)[AID] 
Target
Name:
Phosphoethanolamine/phosphocholine phosphatase
Synonyms:
PHOP1_HUMAN phosphatase, orphan 1
Type:
Enzyme Catalytic Domain
Mol. Mass.:
29718.09
Organism:
Homo sapiens (Human)
Description:
Q8TCT1
Residue:
267
  
Inhibitor
Name:
BDBM46087
Synonyms:
5-fluoranyl-2-(4-methoxyphenyl)-1,2-benzothiazol-3-one MLS-0390936.0001 | cid_25181243
Type:
Small organic molecule
Emp. Form.:
C14H10FNO2S
Mol. Mass.:
275.298
SMILES:
COc1ccc(cc1)-n1sc2ccc(F)cc2c1=O
: