Target
Broad substrate specificity ATP-binding cassette transporter ABCG2
Ligand
BDBM33771
Substrate
Meas. Tech.
Dose Response for ABC transporter inhibitors: specifically ABCG2 screen, ABCB1 counter-screen
EC50
1570±n/a nM
Citation
 PubChem, PC Dose Response for ABC transporter inhibitors: specifically ABCG2 screen, ABCB1 counter-screen PubChem Bioassay (2009)[AID] 
Target
Name:
Broad substrate specificity ATP-binding cassette transporter ABCG2
Synonyms:
ABCG2 ABCP ATP-binding cassette sub-family G member 2 ATP-binding cassette, sub-family G, member 2 BCRP1 CDw338 Mitoxantrone resistance-associated protein Urate exporter
Type:
Multi-pass membrane protein; monomer or homodimer; disulfide-linked
Mol. Mass.:
72329.48
Organism:
Homo sapiens (Human)
Description:
Q9UNQ0
Residue:
655
  
Inhibitor
Name:
BDBM33771
Synonyms:
(6-nitro-4H-1,3-benzodioxin-8-yl)methyl 2-(benzenesulfonamido)-3-methylbutanoate 2-(benzenesulfonamido)-3-methyl-butyric acid (6-nitro-4H-1,3-benzodioxin-8-yl)methyl ester MLS000393258 cid_5131866
Type:
Small organic molecule
Emp. Form.:
C20H22N2O8S
Mol. Mass.:
450.462
SMILES:
CC(C)C(NS(=O)(=O)c1ccccc1)C(=O)OCc1cc(cc2COCOc12)[N+]([O-])=O
: