Target
Tyrosine-protein kinase JAK2
Ligand
BDBM47421
Substrate
Meas. Tech.
Luminescent counterscreen for inhibitors of the Janus kinase 2 mutant JAK2V617F: dose response cell-based high throughput screening assay for inhibitors of parental Ba/F3 cell viability.
IC50
4373±n/a nM
Citation
 PubChem, PC Luminescent counterscreen for inhibitors of the Janus kinase 2 mutant JAK2V617F: dose response cell-based high throughput screening assay for inhibitors of parental Ba/F3 cell viability. PubChem Bioassay (2009)[AID] 
Target
Name:
Tyrosine-protein kinase JAK2
Synonyms:
JAK-2 JAK2_HUMAN Janus kinase 2 (JAK2) | Janus kinase 2 (a protein tyrosine kinase)
Type:
Protein
Mol. Mass.:
130684.68
Organism:
Homo sapiens (Human)
Description:
O60674
Residue:
1132
  
Inhibitor
Name:
BDBM47421
Synonyms:
MLS000374912 N-(1-adamantylcarbamoyl)-2-chloro-acetamide N-[(1-adamantylamino)-oxomethyl]-2-chloroacetamide cid_2378425
Type:
Small organic molecule
Emp. Form.:
C13H19ClN2O2
Mol. Mass.:
270.755
SMILES:
[H]C12CC3([H])CC([H])(C1)CC(C2)(C3)NC(=O)NC(=O)CCl
: