Target
Tyrosine-protein kinase JAK2
Ligand
BDBM47429
Substrate
Meas. Tech.
Luminescent counterscreen for inhibitors of the Janus kinase 2 mutant JAK2V617F: dose response cell-based high throughput screening assay for inhibitors of parental Ba/F3 cell viability.
IC50
4555±n/a nM
Citation
 PubChem, PC Luminescent counterscreen for inhibitors of the Janus kinase 2 mutant JAK2V617F: dose response cell-based high throughput screening assay for inhibitors of parental Ba/F3 cell viability. PubChem Bioassay (2009)[AID] 
Target
Name:
Tyrosine-protein kinase JAK2
Synonyms:
JAK-2 JAK2_HUMAN Janus kinase 2 (JAK2) | Janus kinase 2 (a protein tyrosine kinase)
Type:
Protein
Mol. Mass.:
130684.68
Organism:
Homo sapiens (Human)
Description:
O60674
Residue:
1132
  
Inhibitor
Name:
BDBM47429
Synonyms:
7-chloranyl-1,3,6-trimethyl-pteridine-2,4-dione 7-chloro-1,3,6-trimethyl-pteridine-2,4-quinone MLS000699625 cid_822208
Type:
Small organic molecule
Emp. Form.:
C9H9ClN4O2
Mol. Mass.:
240.646
SMILES:
Cc1nc2c(nc1Cl)n(C)c(=O)n(C)c2=O
: