Target
Tyrosine-protein kinase JAK2
Ligand
BDBM47445
Substrate
Meas. Tech.
Luminescent counterscreen for inhibitors of the Janus kinase 2 mutant JAK2V617F: dose response cell-based high throughput screening assay for inhibitors of parental Ba/F3 cell viability.
IC50
3699±n/a nM
Citation
 PubChem, PC Luminescent counterscreen for inhibitors of the Janus kinase 2 mutant JAK2V617F: dose response cell-based high throughput screening assay for inhibitors of parental Ba/F3 cell viability. PubChem Bioassay (2009)[AID] 
Target
Name:
Tyrosine-protein kinase JAK2
Synonyms:
JAK-2 JAK2_HUMAN Janus kinase 2 (JAK2) | Janus kinase 2 (a protein tyrosine kinase)
Type:
Protein
Mol. Mass.:
130684.68
Organism:
Homo sapiens (Human)
Description:
O60674
Residue:
1132
  
Inhibitor
Name:
BDBM47445
Synonyms:
5-nitro-N-[3-(2-thenoylamino)phenyl]-2-furamide 5-nitro-N-[3-(thiophene-2-carbonylamino)phenyl]furan-2-carboxamide MLS000765466 cid_1164613
Type:
Small organic molecule
Emp. Form.:
C16H11N3O5S
Mol. Mass.:
357.341
SMILES:
[O-][N+](=O)c1ccc(o1)C(=O)Nc1cccc(NC(=O)c2cccs2)c1
: