Target
Tyrosine-protein kinase JAK2
Ligand
BDBM47453
Substrate
Meas. Tech.
Luminescent counterscreen for inhibitors of the Janus kinase 2 mutant JAK2V617F: dose response cell-based high throughput screening assay for inhibitors of parental Ba/F3 cell viability.
IC50
5462±n/a nM
Citation
 PubChem, PC Luminescent counterscreen for inhibitors of the Janus kinase 2 mutant JAK2V617F: dose response cell-based high throughput screening assay for inhibitors of parental Ba/F3 cell viability. PubChem Bioassay (2009)[AID] 
Target
Name:
Tyrosine-protein kinase JAK2
Synonyms:
JAK-2 JAK2_HUMAN Janus kinase 2 (JAK2) | Janus kinase 2 (a protein tyrosine kinase)
Type:
Protein
Mol. Mass.:
130684.68
Organism:
Homo sapiens (Human)
Description:
O60674
Residue:
1132
  
Inhibitor
Name:
BDBM47453
Synonyms:
4-[3-(2,4-dimethylanilino)-2-[(2,4-dimethylanilino)-oxomethyl]-3-oxoprop-1-enyl]benzoic acid 4-[3-(2,4-dimethylanilino)-2-[(2,4-dimethylphenyl)carbamoyl]-3-oxoprop-1-enyl]benzoic acid MLS000761169 cid_4882569
Type:
Small organic molecule
Emp. Form.:
C27H26N2O4
Mol. Mass.:
442.5063
SMILES:
[#6]-c1ccc(-[#7]-[#6](=O)-[#6](=[#6]/c2ccc(cc2)-[#6](-[#8])=O)\[#6](=O)-[#7]-c2ccc(-[#6])cc2-[#6])c(-[#6])c1
: