Target
Tyrosine-protein kinase JAK2
Ligand
BDBM47455
Substrate
Meas. Tech.
Luminescent counterscreen for inhibitors of the Janus kinase 2 mutant JAK2V617F: dose response cell-based high throughput screening assay for inhibitors of parental Ba/F3 cell viability.
IC50
1110±n/a nM
Citation
 PubChem, PC Luminescent counterscreen for inhibitors of the Janus kinase 2 mutant JAK2V617F: dose response cell-based high throughput screening assay for inhibitors of parental Ba/F3 cell viability. PubChem Bioassay (2009)[AID] 
Target
Name:
Tyrosine-protein kinase JAK2
Synonyms:
JAK-2 JAK2_HUMAN Janus kinase 2 (JAK2) | Janus kinase 2 (a protein tyrosine kinase)
Type:
Protein
Mol. Mass.:
130684.68
Organism:
Homo sapiens (Human)
Description:
O60674
Residue:
1132
  
Inhibitor
Name:
BDBM47455
Synonyms:
2-chloranyl-N-[3-[(2-chlorophenyl)methyl]-1,3-thiazol-2-ylidene]ethanamide 2-chloro-N-[3-[(2-chlorophenyl)methyl]-1,3-thiazol-2-ylidene]acetamide MLS001033149 cid_2416356
Type:
Small organic molecule
Emp. Form.:
C12H10Cl2N2OS
Mol. Mass.:
301.192
SMILES:
ClCC(=O)N=c1sccn1Cc1ccccc1Cl
: