Target
Tyrosine-protein kinase JAK2
Ligand
BDBM47464
Substrate
Meas. Tech.
Luminescent counterscreen for inhibitors of the Janus kinase 2 mutant JAK2V617F: dose response cell-based high throughput screening assay for inhibitors of parental Ba/F3 cell viability.
IC50
1421±n/a nM
Citation
 PubChem, PC Luminescent counterscreen for inhibitors of the Janus kinase 2 mutant JAK2V617F: dose response cell-based high throughput screening assay for inhibitors of parental Ba/F3 cell viability. PubChem Bioassay (2009)[AID] 
Target
Name:
Tyrosine-protein kinase JAK2
Synonyms:
JAK-2 JAK2_HUMAN Janus kinase 2 (JAK2) | Janus kinase 2 (a protein tyrosine kinase)
Type:
Protein
Mol. Mass.:
130684.68
Organism:
Homo sapiens (Human)
Description:
O60674
Residue:
1132
  
Inhibitor
Name:
BDBM47464
Synonyms:
6-(chloromethyl)-2-N-(4-methylphenyl)-1,3,5-triazine-2,4-diamine 6-Chloromethyl-N-p-tolyl-[1,3,5]triazine-2,4-diamine SMR000436245 cid_935910
Type:
Small organic molecule
Emp. Form.:
C11H12ClN5
Mol. Mass.:
249.699
SMILES:
Cc1ccc(Nc2nc(N)nc(CCl)n2)cc1
: