Target
Tyrosine-protein kinase JAK2
Ligand
BDBM47481
Substrate
Meas. Tech.
Luminescent counterscreen for inhibitors of the Janus kinase 2 mutant JAK2V617F: dose response cell-based high throughput screening assay for inhibitors of parental Ba/F3 cell viability.
IC50
3615±n/a nM
Citation
 PubChem, PC Luminescent counterscreen for inhibitors of the Janus kinase 2 mutant JAK2V617F: dose response cell-based high throughput screening assay for inhibitors of parental Ba/F3 cell viability. PubChem Bioassay (2009)[AID] 
Target
Name:
Tyrosine-protein kinase JAK2
Synonyms:
JAK-2 JAK2_HUMAN Janus kinase 2 (JAK2) | Janus kinase 2 (a protein tyrosine kinase)
Type:
Protein
Mol. Mass.:
130684.68
Organism:
Homo sapiens (Human)
Description:
O60674
Residue:
1132
  
Inhibitor
Name:
BDBM47481
Synonyms:
(3E,5E)-3,5-bis[(3-methoxy-4-oxidanyl-phenyl)methylidene]oxan-4-one (3E,5E)-3,5-bis[(4-hydroxy-3-methoxyphenyl)methylidene]oxan-4-one 3,5-di(4-hydroxy-3-methoxybenzylidene)tetrahydro-2H-pyran-4-one SMR000456962 | cid_5703486
Type:
Small organic molecule
Emp. Form.:
C21H20O6
Mol. Mass.:
368.3799
SMILES:
COc1cc(\C=C2/COC\C(=C/c3ccc(O)c(OC)c3)C2=O)ccc1O
: