Target
Sphingosine 1-phosphate receptor 1
Ligand
BDBM30721
Substrate
Meas. Tech.
Fluorescence-based counterscreen assay for S1P4 agonists: Cell-based dose response high throughput screening assay to identify agonists of the Sphingosine 1-Phosphate Receptor 1 (S1P1)
EC50
>49800±n/a nM
Citation
 PubChem, PC Fluorescence-based counterscreen assay for S1P4 agonists: Cell-based dose response high throughput screening assay to identify agonists of the Sphingosine 1-Phosphate Receptor 1 (S1P1) PubChem Bioassay (2010)[AID] 
Target
Name:
Sphingosine 1-phosphate receptor 1
Synonyms:
CHEDG1 Endothelial differentiation G-protein coupled receptor 1 S1P1 S1PR1_HUMAN Sphingosine 1-phosphate receptor Edg-1
Type:
Enzyme
Mol. Mass.:
42836.02
Organism:
Homo sapiens (Human)
Description:
P21453
Residue:
382
  
Inhibitor
Name:
BDBM30721
Synonyms:
6-chloranyl-4-phenyl-2-piperazin-1-yl-quinazoline 6-chloro-4-phenyl-2-piperazin-1-ylquinazoline MLS000027613 cid_658787
Type:
Small organic molecule
Emp. Form.:
C18H17ClN4
Mol. Mass.:
324.807
SMILES:
Clc1ccc2nc(nc(-c3ccccc3)c2c1)N1CCNCC1
: