Target
Sphingosine 1-phosphate receptor 1
Ligand
BDBM41680
Substrate
Meas. Tech.
Fluorescence-based counterscreen assay for S1P4 agonists: Cell-based dose response high throughput screening assay to identify agonists of the Sphingosine 1-Phosphate Receptor 1 (S1P1)
EC50
5980±n/a nM
Citation
 PubChem, PC Fluorescence-based counterscreen assay for S1P4 agonists: Cell-based dose response high throughput screening assay to identify agonists of the Sphingosine 1-Phosphate Receptor 1 (S1P1) PubChem Bioassay (2010)[AID] 
Target
Name:
Sphingosine 1-phosphate receptor 1
Synonyms:
CHEDG1 Endothelial differentiation G-protein coupled receptor 1 S1P1 S1PR1_HUMAN Sphingosine 1-phosphate receptor Edg-1
Type:
Enzyme
Mol. Mass.:
42836.02
Organism:
Homo sapiens (Human)
Description:
P21453
Residue:
382
  
Inhibitor
Name:
BDBM41680
Synonyms:
1-(4-Chloro-phenyl)-5-furan-2-yl-3-thiophen-2-yl-4,5-dihydro-1H-pyrazole 2-(4-chlorophenyl)-3-(2-furanyl)-5-thiophen-2-yl-3,4-dihydropyrazole MLS000566481 cid_2842931
Type:
Small organic molecule
Emp. Form.:
C17H13ClN2OS
Mol. Mass.:
328.816
SMILES:
Clc1ccc(cc1)N1N=C(CC1c1ccco1)c1cccs1
: