Target
Sphingosine 1-phosphate receptor 1
Ligand
BDBM47490
Substrate
Meas. Tech.
Fluorescence-based counterscreen assay for S1P4 agonists: Cell-based dose response high throughput screening assay to identify agonists of the Sphingosine 1-Phosphate Receptor 1 (S1P1)
EC50
>49800±n/a nM
Citation
 PubChem, PC Fluorescence-based counterscreen assay for S1P4 agonists: Cell-based dose response high throughput screening assay to identify agonists of the Sphingosine 1-Phosphate Receptor 1 (S1P1) PubChem Bioassay (2010)[AID] 
Target
Name:
Sphingosine 1-phosphate receptor 1
Synonyms:
CHEDG1 Endothelial differentiation G-protein coupled receptor 1 S1P1 S1PR1_HUMAN Sphingosine 1-phosphate receptor Edg-1
Type:
Enzyme
Mol. Mass.:
42836.02
Organism:
Homo sapiens (Human)
Description:
P21453
Residue:
382
  
Inhibitor
Name:
BDBM47490
Synonyms:
2-[2,5-dimethyl-3-[(2,4,6-triketohexahydropyrimidin-5-ylidene)methyl]pyrrol-1-yl]-4,5,6,7-tetrahydrobenzothiophene-3-carboxylic acid ethyl ester MLS000576650 cid_1330292 ethyl 2-[2,5-dimethyl-3-[[2,4,6-tris(oxidanylidene)-1,3-diazinan-5-ylidene]methyl]pyrrol-1-yl]-4,5,6,7-tetrahydro-1-benzothiophene-3-carboxylate | ethyl 2-{2,5-dimethyl-3-[(2,4,6-trioxotetrahydro-5(2H)-pyrimidinylidene)methyl]-1H-pyrrol-1-yl}-4,5,6,7-tetrahydro-1-benzothiophene-3-carboxylate
Type:
Small organic molecule
Emp. Form.:
C22H23N3O5S
Mol. Mass.:
441.5
SMILES:
CCOC(=O)c1c2CCCCc2sc1-n1c(C)cc(C=C2C(=O)NC(=O)NC2=O)c1C
: