Target
Sphingosine 1-phosphate receptor 1
Ligand
BDBM47491
Substrate
Meas. Tech.
Fluorescence-based counterscreen assay for S1P4 agonists: Cell-based dose response high throughput screening assay to identify agonists of the Sphingosine 1-Phosphate Receptor 1 (S1P1)
EC50
>49800±n/a nM
Citation
 PubChem, PC Fluorescence-based counterscreen assay for S1P4 agonists: Cell-based dose response high throughput screening assay to identify agonists of the Sphingosine 1-Phosphate Receptor 1 (S1P1) PubChem Bioassay (2010)[AID] 
Target
Name:
Sphingosine 1-phosphate receptor 1
Synonyms:
CHEDG1 Endothelial differentiation G-protein coupled receptor 1 S1P1 S1PR1_HUMAN Sphingosine 1-phosphate receptor Edg-1
Type:
Enzyme
Mol. Mass.:
42836.02
Organism:
Homo sapiens (Human)
Description:
P21453
Residue:
382
  
Inhibitor
Name:
BDBM47491
Synonyms:
2-(3-formyl-2,5-dimethyl-1-pyrrolyl)-4,5,6,7-tetrahydro-1-benzothiophene-3-carboxylic acid methyl ester MLS000572617 cid_879331 methyl 2-(3-formyl-2,5-dimethylpyrrol-1-yl)-4,5,6,7-tetrahydro-1-benzothiophene-3-carboxylate | methyl 2-(3-methanoyl-2,5-dimethyl-pyrrol-1-yl)-4,5,6,7-tetrahydro-1-benzothiophene-3-carboxylate
Type:
Small organic molecule
Emp. Form.:
C17H19NO3S
Mol. Mass.:
317.403
SMILES:
COC(=O)c1c2CCCCc2sc1-n1c(C)cc(C=O)c1C
: