Target
Sphingosine 1-phosphate receptor 1
Ligand
BDBM47501
Substrate
Meas. Tech.
Fluorescence-based counterscreen assay for S1P4 agonists: Cell-based dose response high throughput screening assay to identify agonists of the Sphingosine 1-Phosphate Receptor 1 (S1P1)
EC50
22000±n/a nM
Citation
 PubChem, PC Fluorescence-based counterscreen assay for S1P4 agonists: Cell-based dose response high throughput screening assay to identify agonists of the Sphingosine 1-Phosphate Receptor 1 (S1P1) PubChem Bioassay (2010)[AID] 
Target
Name:
Sphingosine 1-phosphate receptor 1
Synonyms:
CHEDG1 Endothelial differentiation G-protein coupled receptor 1 S1P1 S1PR1_HUMAN Sphingosine 1-phosphate receptor Edg-1
Type:
Enzyme
Mol. Mass.:
42836.02
Organism:
Homo sapiens (Human)
Description:
P21453
Residue:
382
  
Inhibitor
Name:
BDBM47501
Synonyms:
(2S)-4-methyl-2-[[5-(methylcarbamoyl)-1H-imidazole-4-carbonyl]amino]valeric acid benzyl ester (phenylmethyl) (2S)-4-methyl-2-[[5-(methylcarbamoyl)-1H-imidazol-4-yl]carbonylamino]pentanoate SMR000391229 cid_16196388
Type:
Small organic molecule
Emp. Form.:
C19H24N4O4
Mol. Mass.:
372.4183
SMILES:
CNC(=O)c1nc[nH]c1C(=O)N[C@@H](CC(C)C)C(=O)OCc1ccccc1
: