Target
Sphingosine 1-phosphate receptor 1
Ligand
BDBM47505
Substrate
Meas. Tech.
Fluorescence-based counterscreen assay for S1P4 agonists: Cell-based dose response high throughput screening assay to identify agonists of the Sphingosine 1-Phosphate Receptor 1 (S1P1)
EC50
>49800±n/a nM
Citation
 PubChem, PC Fluorescence-based counterscreen assay for S1P4 agonists: Cell-based dose response high throughput screening assay to identify agonists of the Sphingosine 1-Phosphate Receptor 1 (S1P1) PubChem Bioassay (2010)[AID] 
Target
Name:
Sphingosine 1-phosphate receptor 1
Synonyms:
CHEDG1 Endothelial differentiation G-protein coupled receptor 1 S1P1 S1PR1_HUMAN Sphingosine 1-phosphate receptor Edg-1
Type:
Enzyme
Mol. Mass.:
42836.02
Organism:
Homo sapiens (Human)
Description:
P21453
Residue:
382
  
Inhibitor
Name:
BDBM47505
Synonyms:
2-hydroxy-3,5-di(propan-2-yl)benzoic acid [2-[[(2-furanylmethylamino)-oxomethyl]amino]-2-oxoethyl] ester MLS000776479 [2-(furan-2-ylmethylcarbamoylamino)-2-oxidanylidene-ethyl] 2-oxidanyl-3,5-di(propan-2-yl)benzoate cid_2475649
Type:
Small organic molecule
Emp. Form.:
C21H26N2O6
Mol. Mass.:
402.4409
SMILES:
CC(C)c1cc(C(C)C)c(O)c(c1)C(=O)OCC(=O)NC(=O)NCc1ccco1
: