Target
Solute carrier family 12 member 5
Ligand
BDBM43876
Substrate
Meas. Tech.
Identification of Novel Modulators of Cl- dependent Transport Process via HTS: Dose-Dependent Assay 2 with KCC2
EC50
385±n/a nM
Citation
 PubChem, PC Identification of Novel Modulators of Cl- dependent Transport Process via HTS: Dose-Dependent Assay 2 with KCC2 PubChem Bioassay (2009)[AID] 
Target
Name:
Solute carrier family 12 member 5
Synonyms:
Electroneutral potassium-chloride cotransporter 2 KCC2 Neuronal K-Cl cotransporter SLC12A5 electroneutral potassium-chloride cotransporter KCC2 | hKCC2
Type:
PROTEIN
Mol. Mass.:
126185.18
Organism:
Homo sapiens (Human)
Description:
ChEMBL_828024
Residue:
1139
  
Inhibitor
Name:
BDBM43876
Synonyms:
1-(4-methoxybenzyl)-1H-benzimidazole-2-thiol 3-p-anisyl-1H-benzimidazole-2-thione SMR000296324 | cid_703809
Type:
Small organic molecule
Emp. Form.:
C15H14N2OS
Mol. Mass.:
270.349
SMILES:
COc1ccc(Cn2c3ccccc3[nH]c2=S)cc1
: