Target
Solute carrier family 12 member 5
Ligand
BDBM47535
Substrate
Meas. Tech.
Identification of Novel Modulators of Cl- dependent Transport Process via HTS; Dose-dependent Assay with KCC2
EC50
296000±n/a nM
Citation
 PubChem, PC Identification of Novel Modulators of Cl- dependent Transport Process via HTS; Dose-dependent Assay with KCC2 PubChem Bioassay (2009)[AID] 
Target
Name:
Solute carrier family 12 member 5
Synonyms:
Electroneutral potassium-chloride cotransporter 2 KCC2 Neuronal K-Cl cotransporter SLC12A5 electroneutral potassium-chloride cotransporter KCC2 | hKCC2
Type:
PROTEIN
Mol. Mass.:
126185.18
Organism:
Homo sapiens (Human)
Description:
ChEMBL_828024
Residue:
1139
  
Inhibitor
Name:
BDBM47535
Synonyms:
MLS000583293 N-[(3-bromophenyl)carbamothioyl]-3-phenyl-propanamide N-[(3-bromophenyl)thiocarbamoyl]-3-phenyl-propionamide SMR000201129 | cid_2226419
Type:
Small organic molecule
Emp. Form.:
C16H15BrN2OS
Mol. Mass.:
363.272
SMILES:
Brc1cccc(NC(=S)NC(=O)CCc2ccccc2)c1
: