Target
Solute carrier family 12 member 5
Ligand
BDBM44064
Substrate
Meas. Tech.
Identification of Novel Modulators of Cl- dependent Transport Process via HTS; Dose-dependent Assay with KCC2
EC50
5860±n/a nM
Citation
 PubChem, PC Identification of Novel Modulators of Cl- dependent Transport Process via HTS; Dose-dependent Assay with KCC2 PubChem Bioassay (2009)[AID] 
Target
Name:
Solute carrier family 12 member 5
Synonyms:
Electroneutral potassium-chloride cotransporter 2 KCC2 Neuronal K-Cl cotransporter SLC12A5 electroneutral potassium-chloride cotransporter KCC2 | hKCC2
Type:
PROTEIN
Mol. Mass.:
126185.18
Organism:
Homo sapiens (Human)
Description:
ChEMBL_828024
Residue:
1139
  
Inhibitor
Name:
BDBM44064
Synonyms:
1-[(2-oxidanylidene-5-propan-2-yl-indol-3-yl)amino]-3-propan-2-yl-thiourea 1-[(2-oxo-5-propan-2-ylindol-3-yl)amino]-3-propan-2-ylthiourea MLS000374680 cid_6110811
Type:
Small organic molecule
Emp. Form.:
C15H20N4OS
Mol. Mass.:
304.41
SMILES:
CC(C)NC(=S)NNC1=c2cc(ccc2=NC1=O)C(C)C
: