Target
Solute carrier family 12 member 5
Ligand
BDBM44166
Substrate
Meas. Tech.
Identification of Novel Modulators of Cl- dependent Transport Process via HTS; Dose-dependent Assay with KCC2
EC50
189±n/a nM
Citation
 PubChem, PC Identification of Novel Modulators of Cl- dependent Transport Process via HTS; Dose-dependent Assay with KCC2 PubChem Bioassay (2009)[AID] 
Target
Name:
Solute carrier family 12 member 5
Synonyms:
Electroneutral potassium-chloride cotransporter 2 KCC2 Neuronal K-Cl cotransporter SLC12A5 electroneutral potassium-chloride cotransporter KCC2 | hKCC2
Type:
PROTEIN
Mol. Mass.:
126185.18
Organism:
Homo sapiens (Human)
Description:
ChEMBL_828024
Residue:
1139
  
Inhibitor
Name:
BDBM44166
Synonyms:
MLS000858987 N'-(4-phenyl-1,3-thiazol-2-yl)thiophene-2-carbohydrazide N'-(4-phenylthiazol-2-yl)thiophene-2-carbohydrazide cid_2817110
Type:
Small organic molecule
Emp. Form.:
C14H11N3OS2
Mol. Mass.:
301.387
SMILES:
O=C(NNc1nc(cs1)-c1ccccc1)c1cccs1
: