Target
Muscarinic acetylcholine receptor M3
Ligand
BDBM43820
Substrate
Meas. Tech.
Discovery of novel allosteric modulators of the M1 muscarinic receptor: Agonist NMS competition at M3
EC50
59340±n/a nM
Citation
 PubChem, PC Discovery of novel allosteric modulators of the M1 muscarinic receptor: Agonist NMS competition at M3 PubChem Bioassay (2009)[AID] 
Target
Name:
Muscarinic acetylcholine receptor M3
Synonyms:
ACM3_HUMAN Cholinergic, muscarinic M3 Muscarinic receptor M3 | RecName: Full=Muscarinic acetylcholine receptor M3
Type:
Enzyme
Mol. Mass.:
66151.03
Organism:
Homo sapiens (Human)
Description:
P20309
Residue:
590
  
Inhibitor
Name:
BDBM43820
Synonyms:
4-[2-(2-Chloro-benzoylamino)-ethylamino]-piperidine-1-carboxylic acid ethyl ester 4-[2-[[(2-chlorophenyl)-oxomethyl]amino]ethylamino]-1-piperidinecarboxylic acid ethyl ester cid_644390 ethyl 4-[2-[(2-chlorophenyl)carbonylamino]ethylamino]piperidine-1-carboxylate
Type:
Small organic molecule
Emp. Form.:
C17H24ClN3O3
Mol. Mass.:
353.844
SMILES:
CCOC(=O)N1CCC(CC1)NCCNC(=O)c1ccccc1Cl
: